BDBM548559 WO2022093881, Ex-10.68
SMILES C[C@@]1(COC[C@H]1F)N1CCN(CC1)c1cc2cc(NC(=O)[C@@H]3CC[C@H]3C#N)ncc2cc1Cl
InChI Key InChIKey=ZVFXJKHZIQETKE-SNMWEKIMSA-N
Data  1 IC50
  Tab Delimited (TSV)   2D SDfile   Computed 3D by Vconf -m prep SDfile
Find this compound or compounds like it in BindingDB:
Activity Spreadsheet -- Enzyme Inhibition Constant Data from BindingDB
Found 1 hit for monomerid = 548559
TargetLeucine-rich repeat serine/threonine-protein kinase 2 [G2019S](Homo sapiens (Human))
Merck Sharp &Amp
WIPO
LigandPNGBDBM548559(WO2022093881, Ex-10.68)
Affinity DataIC50:  0.0800nM. Assay description:  The LRRK2 kinase activity reported herein as IC50 values was determined with LanthaScreen™ technology from Life Technologies Corporation (Carlsbad, ...
Ligand InfoPC cidPC sid
In DepthDetails PubMed