BDBM548592 WO2022093881, Ex-11.5
SMILES C[C@]1(COC[C@@H]1O)N1CCN(CC1)c1cc2cc(NC(=O)[C@@H]3CC[C@H]3c3ccccn3)ncc2cc1Cl
InChI Key InChIKey=YOPMSLHFTNVHDK-YZRFWSPWSA-N
Data  1 IC50
  Tab Delimited (TSV)   2D SDfile   Computed 3D by Vconf -m prep SDfile
Find this compound or compounds like it in BindingDB:
Activity Spreadsheet -- Enzyme Inhibition Constant Data from BindingDB
Found 1 hit for monomerid = 548592
TargetLeucine-rich repeat serine/threonine-protein kinase 2 [G2019S](Homo sapiens (Human))
Merck Sharp &Amp
WIPO
LigandPNGBDBM548592(WO2022093881, Ex-11.5)
Affinity DataIC50:  0.0800nM. Assay description:  The LRRK2 kinase activity reported herein as IC50 values was determined with LanthaScreen™ technology from Life Technologies Corporation (Carlsbad, ...
Ligand InfoPC cidPC sid
In DepthDetails PubMed