BDBM551742 US11312722, Compound 32
SMILES COc1ccc(Cn2nc(C)cc2Nc2cc(O)cc(O)c2C(=O)N2Cc3ccc(NC4CCN(C)CC4)cc3C2)cc1
InChI Key InChIKey=VHZUSFGRSBECKU-UHFFFAOYSA-N
Data  2 EC50
  Tab Delimited (TSV)   2D SDfile   Computed 3D by Vconf -m prep SDfile
Find this compound or compounds like it in BindingDB:
Activity Spreadsheet -- Enzyme Inhibition Constant Data from BindingDB
Found 2 hits for monomerid = 551742
TargetHeat shock protein 90 homolog(Yeast)
Trustees Of Boston University
US Patent
LigandPNGBDBM551742(US11312722, Compound 32)
Affinity DataEC50:  171nM. Assay description: EC50 values were determined by FP-based equilibrium competition assay performed in 384-well format using whole cell lysates prepared from C. neoforma...
Ligand InfoPC cidPC sid
In DepthDetails US Patent
TargetHsp90 chaperone protein kinase-targeting subunit(Filobasidiella neoformans)
Trustees Of Boston University
US Patent
LigandPNGBDBM551742(US11312722, Compound 32)
Affinity DataEC50:  96nM. Assay description: EC50 values were determined by FP-based equilibrium competition assay performed in 384-well format using whole cell lysates prepared from C. neoforma...
Ligand InfoPC cidPC sid
In DepthDetails US Patent