BDBM551752 US11312722, Compound 42
SMILES COc1ccc(Cn2ncc(C(C)C)c2Nc2cc(O)cc(O)c2C(=O)N2Cc3ccccc3C2)cc1
InChI Key InChIKey=AZNAKJIPSUOGNI-UHFFFAOYSA-N
Data  1 EC50
  Tab Delimited (TSV)   2D SDfile   Computed 3D by Vconf -m prep SDfile
Find this compound or compounds like it in BindingDB:
Activity Spreadsheet -- Enzyme Inhibition Constant Data from BindingDB
Found 1 hit for monomerid = 551752
TargetHsp90 chaperone protein kinase-targeting subunit(Filobasidiella neoformans)
Trustees Of Boston University
US Patent
LigandPNGBDBM551752(US11312722, Compound 42)
Affinity DataEC50:  396nM. Assay description: EC50 values were determined by FP-based equilibrium competition assay performed in 384-well format using whole cell lysates prepared from C. neoforma...
Ligand InfoPC cidPC sid
In DepthDetails US Patent