BDBM551753 US11312722, Compound 43
SMILES COc1ccc(Cn2ncc(c2Nc2cc(O)cc(O)c2C(=O)N2Cc3ccccc3C2)-c2ccccc2)cc1
InChI Key InChIKey=DVNPNPBZEBQIBE-UHFFFAOYSA-N
Data  1 EC50
  Tab Delimited (TSV)   2D SDfile   Computed 3D by Vconf -m prep SDfile
Find this compound or compounds like it in BindingDB:
Activity Spreadsheet -- Enzyme Inhibition Constant Data from BindingDB
Found 1 hit for monomerid = 551753
TargetHsp90 chaperone protein kinase-targeting subunit(Filobasidiella neoformans)
Trustees Of Boston University
US Patent
LigandPNGBDBM551753(US11312722, Compound 43)
Affinity DataEC50:  1.62E+3nM. Assay description: EC50 values were determined by FP-based equilibrium competition assay performed in 384-well format using whole cell lysates prepared from C. neoforma...
Ligand InfoPC cidPC sid
In DepthDetails US Patent