BDBM551756 US11312722, Compound 46
SMILES COc1ccc(Cn2nc(cc2Nc2cc(O)cc(O)c2C(=O)N2Cc3cn[nH]c3C2)C(C)C)cc1
InChI Key InChIKey=UYRCXXZFHNZBNX-UHFFFAOYSA-N
Data  1 EC50
  Tab Delimited (TSV)   2D SDfile   Computed 3D by Vconf -m prep SDfile
Find this compound or compounds like it in BindingDB:
Activity Spreadsheet -- Enzyme Inhibition Constant Data from BindingDB
Found 1 hit for monomerid = 551756
TargetHsp90 chaperone protein kinase-targeting subunit(Filobasidiella neoformans)
Trustees Of Boston University
US Patent
LigandPNGBDBM551756(US11312722, Compound 46)
Affinity DataEC50:  25nM. Assay description: EC50 values were determined by FP-based equilibrium competition assay performed in 384-well format using whole cell lysates prepared from C. neoforma...
Ligand InfoPC cidPC sid
In DepthDetails US Patent