BDBM551768 US11312722, Compound 58
SMILES Cn1nccc1Nc1cc(O)cc(O)c1C(=O)N1Cc2cn[nH]c2C1
InChI Key InChIKey=ZKNGLEABRCYJBX-UHFFFAOYSA-N
Data  1 EC50
  Tab Delimited (TSV)   2D SDfile   Computed 3D by Vconf -m prep SDfile
Find this compound or compounds like it in BindingDB:
Activity Spreadsheet -- Enzyme Inhibition Constant Data from BindingDB
Found 1 hit for monomerid = 551768
TargetHsp90 chaperone protein kinase-targeting subunit(Filobasidiella neoformans)
Trustees Of Boston University
US Patent
LigandPNGBDBM551768(US11312722, Compound 58)
Affinity DataEC50:  142nM. Assay description: EC50 values were determined by FP-based equilibrium competition assay performed in 384-well format using whole cell lysates prepared from C. neoforma...
Ligand InfoPC cidPC sid
In DepthDetails US Patent