BDBM551772 US11312722, Compound 62
SMILES CC(C)(C)n1nccc1Nc1cc(O)cc(O)c1C(=O)N1Cc2ccccc2C1
InChI Key InChIKey=CKWDGSSIBWRWCK-UHFFFAOYSA-N
Data  1 EC50
  Tab Delimited (TSV)   2D SDfile   Computed 3D by Vconf -m prep SDfile
Find this compound or compounds like it in BindingDB:
Activity Spreadsheet -- Enzyme Inhibition Constant Data from BindingDB
Found 1 hit for monomerid = 551772
TargetHsp90 chaperone protein kinase-targeting subunit(Filobasidiella neoformans)
Trustees Of Boston University
US Patent
LigandPNGBDBM551772(US11312722, Compound 62)
Affinity DataEC50:  62nM. Assay description: EC50 values were determined by FP-based equilibrium competition assay performed in 384-well format using whole cell lysates prepared from C. neoforma...
Ligand InfoPC cidPC sid
In DepthDetails US Patent