BDBM552965 N-[5-(2,4- dimethoxypyrimidin-5- yl)-4-fluoro-2-(4- methylpiperazin-1- yl)phenyl]-6-oxo-4- (trifluoromethyl)-1H- pyridine-3-carboxamide::US11319299, Example 19
SMILES COc1ncc(c(OC)n1)-c1cc(NC(=O)c2c[nH]c(=O)cc2C(F)(F)F)c(cc1F)N1CCN(C)CC1
InChI Key InChIKey=NXSYJUANRFWWGT-UHFFFAOYSA-N
Data  1 IC50  1 Kd
  Tab Delimited (TSV)   2D SDfile   Computed 3D by Vconf -m prep SDfile
Find this compound or compounds like it in BindingDB:
Activity Spreadsheet -- Enzyme Inhibition Constant Data from BindingDB
Found 2 hits for monomerid = 552965
TargetWD repeat-containing protein 5(Homo sapiens (Human))
Propellon Therapeutics
US Patent
LigandPNGBDBM552965(N-[5-(2,4- dimethoxypyrimidin-5- yl)-4-fluoro-2-(4...)
Affinity DataKd:  4nM. Assay description: Exemplary compounds of the application were dissolved in 100% DMSO at 10 mM, assayed fresh, and then stored at −20° C. for repeat studies and o...
Ligand InfoPC cidPC sid
In DepthDetails US Patent
TargetMLL1-WRAD2 complex(Homo sapiens (Human))
Propellon Therapeutics
US Patent
LigandPNGBDBM552965(N-[5-(2,4- dimethoxypyrimidin-5- yl)-4-fluoro-2-(4...)
Affinity DataIC50:  3.67E+3nM. Assay description: Compound potency was assessed through incorporation of 3H-SAM into oligonucleosomes purified from HeLa cells. Specifically, recombinant human MLL1 (a...
Ligand InfoPC cidPC sid
In DepthDetails US Patent