BDBM553810 US11325905, Compound A76B4C3
SMILES CCCCCCCCCCC[C@H](O)C1C=CC2[C@H](N1Nc1ccc(cc1)N(=O)=O)C(=O)N(C2=O)c1ccccc1
InChI Key InChIKey=WRXRAIVVFMIASK-QYVZARNFSA-N
Data  1 Kd
  Tab Delimited (TSV)   2D SDfile   Computed 3D by Vconf -m prep SDfile
Find this compound or compounds like it in BindingDB:
Activity Spreadsheet -- Enzyme Inhibition Constant Data from BindingDB
Found 1 hit for monomerid = 553810
TargetBifunctional polynucleotide phosphatase/kinase(Human)
The Governors Of The University Of Alberta
US Patent
LigandPNGBDBM553810(US11325905, Compound A76B4C3)
Affinity DataKd:  200nM. Assay description: Kd values were measured by steady-state fluorescence spectroscopy, by following protein tryptophan fluorescence quenching as a function of ligand con...
Ligand InfoPC cidPC sid
In DepthDetails US Patent