BDBM453334 BDBM553837::US10730826, Compound 49a
SMILES NCCCCC(NC(=O)C1CCCC1)C(=O)COc1ccon1
InChI Key InChIKey=MSLOXCJJYLBFIL-UHFFFAOYSA-N
Data  2 IC50
  Tab Delimited (TSV)   2D SDfile   Computed 3D by Vconf -m prep SDfile
Find this compound or compounds like it in BindingDB:
Activity Spreadsheet -- Enzyme Inhibition Constant Data from BindingDB
Found 2 hits for monomerid = 453334
TargetLys-gingipain(Porphyromonas gingivalis)
Cortexyme
US Patent
LigandPNGBDBM453334(BDBM553837 | US10730826, Compound 49a)
Affinity DataIC50:  0.230nM. Assay description: The capacities of compounds of the present invention to inhibit the activity of lysine gingipain (Kgp) were measured in a fluorogenic assay similar t...
Ligand Info
In DepthDetails US Patent
TargetLys-gingipain W83(Porphyromonas gingivalis)
Cortexyme
US Patent
LigandPNGBDBM453334(BDBM553837 | US10730826, Compound 49a)
Affinity DataIC50:  0.230nM. Assay description: The capacities of compounds of the present invention to inhibit the activity of lysine gingipain were measured in a fluorogenic assay similar to thos...
Ligand Info
In DepthDetails US Patent