BDBM453340 BDBM553843::US10730826, Compound 30a
SMILES NCCCCC(NC(=O)c1cccc(OCCCF)c1)C(=O)COc1c(F)cccc1F
InChI Key InChIKey=UYLPNMGAJISQKN-UHFFFAOYSA-N
Data  2 IC50
  Tab Delimited (TSV)   2D SDfile   Computed 3D by Vconf -m prep SDfile
Find this compound or compounds like it in BindingDB:
Activity Spreadsheet -- Enzyme Inhibition Constant Data from BindingDB
Found 2 hits for monomerid = 453340
TargetLys-gingipain(Porphyromonas gingivalis)
Cortexyme
US Patent
LigandPNGBDBM453340(BDBM553843 | US10730826, Compound 30a)
Affinity DataIC50:  0.210nM. Assay description: The capacities of compounds of the present invention to inhibit the activity of lysine gingipain (Kgp) were measured in a fluorogenic assay similar t...
Ligand Info
In DepthDetails US Patent
TargetLys-gingipain W83(Porphyromonas gingivalis)
Cortexyme
US Patent
LigandPNGBDBM453340(BDBM553843 | US10730826, Compound 30a)
Affinity DataIC50:  0.210nM. Assay description: The capacities of compounds of the present invention to inhibit the activity of lysine gingipain were measured in a fluorogenic assay similar to thos...
Ligand Info
In DepthDetails US Patent