BDBM553897 US11325905, Compound A12B4C50
SMILES CCCCCCCCCC[C@H](O)C1C=CC2[C@H](N1Nc1ccc(cc1)N(=O)=O)C(=O)N(C2=O)c1ccc(cc1)N1CCNCC1
InChI Key InChIKey=OCEKYHSBINFMLO-FBVYBBNNSA-N
Data  1 IC50  1 Kd
  Tab Delimited (TSV)   2D SDfile   Computed 3D by Vconf -m prep SDfile
Find this compound or compounds like it in BindingDB:
Activity Spreadsheet -- Enzyme Inhibition Constant Data from BindingDB
Found 2 hits for monomerid = 553897
TargetBifunctional polynucleotide phosphatase/kinase(Human)
The Governors Of The University Of Alberta
US Patent
LigandPNGBDBM553897(US11325905, Compound A12B4C50)
Affinity DataIC50:  1.19E+4nM. Assay description: Kd values were measured by steady-state fluorescence spectroscopy, by following protein tryptophan fluorescence quenching as a function of ligand con...
Ligand InfoPC cidPC sid
In DepthDetails US Patent
TargetBifunctional polynucleotide phosphatase/kinase(Human)
The Governors Of The University Of Alberta
US Patent
LigandPNGBDBM553897(US11325905, Compound A12B4C50)
Affinity DataKd:  105nM. Assay description: Kd values were measured by steady-state fluorescence spectroscopy, by following protein tryptophan fluorescence quenching as a function of ligand con...
Ligand InfoPC cidPC sid
In DepthDetails US Patent