BDBM553924 US11325905, Compound A83B29C63
SMILES COc1ccccc1[C@@H](O)[C@H]1C=C[C@@H]2[C@H](N1Nc1ccc(cc1)S(C)=O)C(=O)N(Cc1cccc3ccccc13)C2=O
InChI Key InChIKey=KKTMLGIIXSWCOA-LAUJGCNLSA-N
Data  1 IC50  1 Kd
  Tab Delimited (TSV)   2D SDfile   Computed 3D by Vconf -m prep SDfile
Find this compound or compounds like it in BindingDB:
Activity Spreadsheet -- Enzyme Inhibition Constant Data from BindingDB
Found 2 hits for monomerid = 553924
TargetBifunctional polynucleotide phosphatase/kinase(Human)
The Governors Of The University Of Alberta
US Patent
LigandPNGBDBM553924(US11325905, Compound A83B29C63)
Affinity DataIC50:  2.00E+4nM. Assay description: Kd values were measured by steady-state fluorescence spectroscopy, by following protein tryptophan fluorescence quenching as a function of ligand con...
Ligand InfoPC cidPC sid
In DepthDetails US Patent
TargetBifunctional polynucleotide phosphatase/kinase(Human)
The Governors Of The University Of Alberta
US Patent
LigandPNGBDBM553924(US11325905, Compound A83B29C63)
Affinity DataKd:  140nM. Assay description: Kd values were measured by steady-state fluorescence spectroscopy, by following protein tryptophan fluorescence quenching as a function of ligand con...
Ligand InfoPC cidPC sid
In DepthDetails US Patent