BDBM556411 US11351149, Example 90
SMILES CC1(C)[C@H]2CN([C@@H]([C@@H]12)C(=O)N[C@@H](C[C@@H]1CCNC1=O)C#N)C(=O)[C@H](Cc1ccccn1)NC(=O)C(F)(F)F
InChI Key InChIKey=UTSXCJSXSSVXHI-QYXZOKGRSA-N
Data  1 KI
  Tab Delimited (TSV)   2D SDfile   Computed 3D by Vconf -m prep SDfile
Find this compound or compounds like it in BindingDB:
Activity Spreadsheet -- Enzyme Inhibition Constant Data from BindingDB
Found 1 hit for monomerid = 556411
TargetReplicase polyprotein 1a(2019-nCoV)
Pfizer
US Patent
LigandPNGBDBM556411(US11351149, Example 90)
Affinity DataKi:  15nM. Assay description: The proteolytic activity of the main protease, 3CLpro, of SARS-CoV-2 was monitored using a continuous fluorescence resonance energy transfer (FRET) a...
Ligand InfoPC cidPC sid
In DepthDetails US Patent