BDBM56142 2-[[2-[(4-methoxy-3-methyl-phenyl)sulfonyl-methyl-amino]acetyl]amino]benzoic acid methyl ester::2-[[2-[(4-methoxy-3-methylphenyl)sulfonyl-methylamino]-1-oxoethyl]amino]benzoic acid methyl ester::MLS000050309::SMR000077523::cid_2214286::methyl 2-({N-[(4-methoxy-3-methylphenyl)sulfonyl]-N-methylglycyl}amino)benzoate::methyl 2-[2-[(4-methoxy-3-methyl-phenyl)sulfonyl-methyl-amino]ethanoylamino]benzoate::methyl 2-[[2-[(4-methoxy-3-methylphenyl)sulfonyl-methylamino]acetyl]amino]benzoate
SMILES COC(=O)c1ccccc1NC(=O)CN(C)S(=O)(=O)c1ccc(OC)c(C)c1
InChI Key InChIKey=LSUWBLOWXHFSMB-UHFFFAOYSA-N
Data  1 IC50
  Tab Delimited (TSV)   2D SDfile   Computed 3D by Vconf -m prep SDfile
Find this compound or compounds like it in BindingDB:
Activity Spreadsheet -- Enzyme Inhibition Constant Data from BindingDB
Found 1 hit for monomerid = 56142
TargetKallikrein-5(Homo sapiens (Human))
Pcmd
Curated by PubChem BioAssay
LigandPNGBDBM56142(2-[[2-[(4-methoxy-3-methyl-phenyl)sulfonyl-methyl-...)
Affinity DataIC50:  5.00E+4nM. Assay description: Molecular Library Screening Center Network (MLSCN) Penn Center for Molecular Discovery (PCMD) Assay Provider: Scott L. Diamond, University of Pennsy...
In DepthDetails PCBioAssay