BDBM563159 US11407738, Example 00333::methyl 2-(2-((2-(3- acetyl-5-(2- methylpyrimidin-5- yl)-1H-indazol-1- yl)acetamido)meth- yl)phenyl)acetate
SMILES COC(=O)Cc1ccccc1CNC(=O)Cn1nc(C(C)=O)c2cc(ccc12)-c1cnc(C)nc1
InChI Key InChIKey=CDWKFYBOUZGROU-UHFFFAOYSA-N
Data  1 IC50
  Tab Delimited (TSV)   2D SDfile   Computed 3D by Vconf -m prep SDfile
Find this compound or compounds like it in BindingDB:
Activity Spreadsheet -- Enzyme Inhibition Constant Data from BindingDB
Found 1 hit for monomerid = 563159
TargetComplement factor D(Homo sapiens (Human))
Achillion Pharmaceuticals
US Patent
LigandPNGBDBM563159(US11407738, Example 00333 | methyl 2-(2-((2-(3- ac...)
Affinity DataIC50: >1.00E+4nM. Assay description: Human Factor D (purified from human serum, Complement Technology, Inc.) at 80 nM final concentration is incubated with test compound at various conce...
Ligand InfoPC cidPC sid
In DepthDetails US Patent