BDBM563296 US11407740, Compound 297
SMILES CS(=O)(=O)N[C@@H](Cc1nc[nH]c(=O)c1O)c1ccc(cc1)C#Cc1ccc(CN2CCNC[C@H]2CO)cc1
InChI Key
Data  1 IC50
  Tab Delimited (TSV)   2D SDfile   Computed 3D by Vconf -m prep SDfile
Find this compound or compounds like it in BindingDB:
Activity Spreadsheet -- Enzyme Inhibition Constant Data from BindingDB
Found 1 hit for monomerid = 563296
TargetUDP-3-O-acyl-N-acetylglucosamine deacetylase(Escherichia coli)
Forge Therapeutics
US Patent
LigandPNGBDBM563296(US11407740, Compound 297)
Affinity DataIC50:  30nM. Assay description: IC50 values against E. coli LpxC were determined using a Rapid Fire MS assay as previously described J. Med. Chem. 2012, 55, 1662-1670.
Ligand InfoPC cidPC sid
In DepthDetails US Patent