BDBM56470 2-(2-Imino-3-methyl-2,3-dihydro-benzoimidazol-1-yl)-1-thiophen-2-yl-ethanone::2-(2-azanylidene-3-methyl-benzimidazol-1-yl)-1-thiophen-2-yl-ethanone;hydrobromide::2-(2-imino-3-methyl-1-benzimidazolyl)-1-thiophen-2-ylethanone;hydrobromide::2-(2-imino-3-methyl-benzimidazol-1-yl)-1-(2-thienyl)ethanone;hydrobromide::2-(2-imino-3-methylbenzimidazol-1-yl)-1-thiophen-2-ylethanone;hydrobromide::CHEMBL373443::MLS000595356::SMR000149879::cid_11957168
SMILES Cn1c2ccccc2n(CC(=O)c2cccs2)c1=N
InChI Key InChIKey=KGOAHDHMLCSFNQ-UHFFFAOYSA-N
Data  1 IC50  1 EC50
  Tab Delimited (TSV)   2D SDfile   Computed 3D by Vconf -m prep SDfile
Find this compound or compounds like it in BindingDB:
Activity Spreadsheet -- Enzyme Inhibition Constant Data from BindingDB
Found 2 hits for monomerid = 56470
LigandPNGBDBM56470(2-(2-Imino-3-methyl-2,3-dihydro-benzoimidazol-1-yl...)
Affinity DataEC50: >3.00E+4nM. Assay description: Activity at Kir6.2/SUR1 KATP channels expressed in HEK293 cells assessed as repolarization of tolbutamide-induced membrane depolarization
In DepthDetails ArticlePubMed
TargetKallikrein-5(Homo sapiens (Human))
Pcmd
Curated by PubChem BioAssay
LigandPNGBDBM56470(2-(2-Imino-3-methyl-2,3-dihydro-benzoimidazol-1-yl...)
Affinity DataIC50:  5.00E+4nM. Assay description: Molecular Library Screening Center Network (MLSCN) Penn Center for Molecular Discovery (PCMD) Assay Provider: Scott L. Diamond, University of Pennsy...
In DepthDetails PCBioAssay