BDBM567103 US11420959, Example I-2
SMILES CCc1c(CC2CCCCC2)nc(SCC(=O)c2ccc(OC(=O)C(N)CC(C)C)cc2)[nH]c1=O
InChI Key
Data  1 EC50
  Tab Delimited (TSV)   2D SDfile   Computed 3D by Vconf -m prep SDfile
Find this compound or compounds like it in BindingDB:
Activity Spreadsheet -- Enzyme Inhibition Constant Data from BindingDB
Found 1 hit for monomerid = 567103
TargetGag-Pol polyprotein(HIV-1)
Yunnan University
US Patent
LigandPNGBDBM567103(US11420959, Example I-2)
Affinity DataEC50:  3nM. Assay description: C8166 cells infected with HIV-1 were used for determining the anti-HIV biological activity at the cellular level. The specific method was described b...
Ligand InfoPC cidPC sid
In DepthDetails US Patent