BDBM567106 US11420959, Example I-5
SMILES CCc1c(CC2CCCCC2)nc(SCC(=O)c2ccc(OC(=O)C(N)Cc3c[nH]c4ccccc34)cc2)[nH]c1=O
InChI Key
Data  1 EC50
  Tab Delimited (TSV)   2D SDfile   Computed 3D by Vconf -m prep SDfile
Find this compound or compounds like it in BindingDB:
Activity Spreadsheet -- Enzyme Inhibition Constant Data from BindingDB
Found 1 hit for monomerid = 567106
TargetGag-Pol polyprotein(HIV-1)
Yunnan University
US Patent
LigandPNGBDBM567106(US11420959, Example I-5)
Affinity DataEC50:  4nM. Assay description: C8166 cells infected with HIV-1 were used for determining the anti-HIV biological activity at the cellular level. The specific method was described b...
Ligand InfoPC cidPC sid
In DepthDetails US Patent