BDBM567120 US11420959, Example I-19
SMILES CC(C)C(N)C(=O)Oc1ccc(cc1)C(=O)CSc1nc(CC2CCCCC2)c(C(C)C)c(=O)[nH]1
InChI Key
Data  1 EC50
  Tab Delimited (TSV)   2D SDfile   Computed 3D by Vconf -m prep SDfile
Find this compound or compounds like it in BindingDB:
Activity Spreadsheet -- Enzyme Inhibition Constant Data from BindingDB
Found 1 hit for monomerid = 567120
TargetGag-Pol polyprotein(HIV-1)
Yunnan University
US Patent
LigandPNGBDBM567120(US11420959, Example I-19)
Affinity DataEC50:  3nM. Assay description: C8166 cells infected with HIV-1 were used for determining the anti-HIV biological activity at the cellular level. The specific method was described b...
Ligand InfoPC cidPC sid
In DepthDetails US Patent