BDBM56799 5-methyl-N-[(3-methyl-2-thienyl)methyl]-3-phenyl-4-isoxazolecarboxamide::5-methyl-N-[(3-methyl-2-thienyl)methyl]-3-phenyl-isoxazole-4-carboxamide::5-methyl-N-[(3-methyl-2-thiophenyl)methyl]-3-phenyl-4-isoxazolecarboxamide::5-methyl-N-[(3-methylthiophen-2-yl)methyl]-3-phenyl-1,2-oxazole-4-carboxamide::MLS000830886::SMR000458307::cid_2811699
SMILES Cc1ccsc1CNC(=O)c1c(C)onc1-c1ccccc1
InChI Key InChIKey=DQVOURGSEIYTCB-UHFFFAOYSA-N
Data  1 IC50
  Tab Delimited (TSV)   2D SDfile   Computed 3D by Vconf -m prep SDfile
Find this compound or compounds like it in BindingDB:
Activity Spreadsheet -- Enzyme Inhibition Constant Data from BindingDB
Found 1 hit for monomerid = 56799
TargetKallikrein-5(Homo sapiens (Human))
Pcmd
Curated by PubChem BioAssay
LigandPNGBDBM56799(5-methyl-N-[(3-methyl-2-thienyl)methyl]-3-phenyl-4...)
Affinity DataIC50:  5.00E+4nM. Assay description: Molecular Library Screening Center Network (MLSCN) Penn Center for Molecular Discovery (PCMD) Assay Provider: Scott L. Diamond, University of Pennsy...
In DepthDetails PCBioAssay