BDBM5707 2-amino-5-thio-substituted thiazole 75::methyl 2-[(2-acetamido-1,3-thiazol-5-yl)sulfanyl]-2-phenylacetate
SMILES COC(=O)C(Sc1cnc(NC(C)=O)s1)c1ccccc1
InChI Key InChIKey=RAWAUACDDZQGFW-UHFFFAOYSA-N
Data  1 IC50
  Tab Delimited (TSV)   2D SDfile   Computed 3D by Vconf -m prep SDfile
Find this compound or compounds like it in BindingDB:
Activity Spreadsheet -- Enzyme Inhibition Constant Data from BindingDB
Found 1 hit for monomerid = 5707
TargetCyclin-dependent kinase 2/G1/S-specific cyclin-E1(Homo sapiens (Human))
Bristol-Myers Squibb Pharmaceutical Research Institute
LigandPNGBDBM5707(2-amino-5-thio-substituted thiazole 75 | methyl 2-...)
Affinity DataIC50: >1.00E+3nM. Assay description:  The enzyme was assayed with substrate in the presence of 25 uM ATP/[gamma-33P] ATP and test compound. Dose response curves were generated to determ...
Ligand InfoPC cidPC sid
In DepthDetails ArticlePubMed