BDBM572530 Ethyl 4-(3-((1-methyl-1H-pyrazol-4-yl)methyl)ureido)benzoate::US11452717, Example 125
SMILES CCOC(=O)c1ccc(NC(=O)NCc2cnn(C)c2)cc1
InChI Key InChIKey=HLERXADBDJITLR-UHFFFAOYSA-N
Data  1 EC50
  Tab Delimited (TSV)   2D SDfile   Computed 3D by Vconf -m prep SDfile
Find this compound or compounds like it in BindingDB:
Activity Spreadsheet -- Enzyme Inhibition Constant Data from BindingDB
Found 1 hit for monomerid = 572530
TargetNicotinamide phosphoribosyltransferase(Homo sapiens (Human))
Sanford Burnham Prebys Medical Discovery Institute
US Patent
LigandPNGBDBM572530(Ethyl 4-(3-((1-methyl-1H-pyrazol-4-yl)methyl)ureid...)
Affinity DataEC50: >2.00E+4nM. Assay description: NAMPT reaction was performed in 50 mM HEPES, pH 7.5, containing 5 mM MgCl2, 0.1% Prionex, 0.005% Tween 20, and 1 mM TCEP at room temperature in Grein...
Ligand InfoPC cidPC sid
In DepthDetails US Patent