BDBM572670 Methyl 4-(4-(3-(pyridin-4-ylmethyl)ureido)benzamido)benzoate::US11452717, Example 111
SMILES COC(=O)c1ccc(NC(=O)c2ccc(NC(=O)NCc3ccncc3)cc2)cc1
InChI Key InChIKey=VRHZTLVOKZPTSR-UHFFFAOYSA-N
Data  1 EC50
  Tab Delimited (TSV)   2D SDfile   Computed 3D by Vconf -m prep SDfile
Find this compound or compounds like it in BindingDB:
Activity Spreadsheet -- Enzyme Inhibition Constant Data from BindingDB
Found 1 hit for monomerid = 572670
TargetNicotinamide phosphoribosyltransferase(Homo sapiens (Human))
Sanford Burnham Prebys Medical Discovery Institute
US Patent
LigandPNGBDBM572670(Methyl 4-(4-(3-(pyridin-4-ylmethyl)ureido)benzamid...)
Affinity DataEC50:  1.05E+3nM. Assay description: NAMPT reaction was performed in 50 mM HEPES, pH 7.5, containing 5 mM MgCl2, 0.1% Prionex, 0.005% Tween 20, and 1 mM TCEP at room temperature in Grein...
Ligand InfoPC cidPC sid
In DepthDetails US Patent