BDBM574747 US11459308, Compound 3557
SMILES [O-][N+](=O)c1ccc(cc1NC(c1ccccc1)c1ccccc1)N1CCN(Cc2ccccn2)CC1
InChI Key InChIKey=VTHOXIMMPRLARD-UHFFFAOYSA-N
Data  2 IC50
  Tab Delimited (TSV)   2D SDfile   Computed 3D by Vconf -m prep SDfile
Find this compound or compounds like it in BindingDB:
Activity Spreadsheet -- Enzyme Inhibition Constant Data from BindingDB
Found 2 hits for monomerid = 574747
TargetEnvelope glycoprotein(ZEBOV)
Microbiotix
US Patent
LigandPNGBDBM574747(US11459308, Compound 3557)
Affinity DataIC50:  1.90E+3nM. Assay description: The authentic filoviruses Ebola virus/H. sapiens-tc/COD/1995/Kikwit-9510621 (EBOV/Kik-9510621; ‘EBOV-Zaire 1995’) (Jahrling et al., J. Infect. Dis., ...
Ligand InfoPC cidPC sid
In DepthDetails US Patent
TargetEnvelope glycoprotein(REBOV)
Microbiotix
US Patent
LigandPNGBDBM574747(US11459308, Compound 3557)
Affinity DataIC50:  1.40E+3nM. Assay description: Recombinant vesicular stomatitis viruses (VSVs) (serotype Indiana) expressing eGFP and EBOV, SUDV, or BDBV GP in place of VSV G, as well as those exp...
Ligand InfoPC cidPC sid
In DepthDetails US Patent