BDBM574980 US11459321, Example 5
SMILES C(c1cnc(s1)N1CCc2ccc(cc2C1)-c1c[nH]nn1)c1ccc(cc1)-n1cccn1
InChI Key InChIKey=RYLJVZOIEWDZQU-UHFFFAOYSA-N
Data  2 IC50
  Tab Delimited (TSV)   2D SDfile   Computed 3D by Vconf -m prep SDfile
Find this compound or compounds like it in BindingDB:
Activity Spreadsheet -- Enzyme Inhibition Constant Data from BindingDB
Found 2 hits for monomerid = 574980
TargetNeuraminidase(Influenza A virus (strain A/Puerto Rico/8/1934 H1N...)
Evrys Bio
US Patent
LigandPNGBDBM574980(US11459321, Example 5)
Affinity DataIC50: >2.50E+4nM. Assay description: To assess their antiviral activity, some compounds were tested against murine adapted human influenza (PR8) in vitro. Canine MDCK cells were grown to...
Ligand InfoPC cidPC sid
In DepthDetails US Patent
LigandPNGBDBM574980(US11459321, Example 5)
Affinity DataIC50:  807nM. Assay description: To assess their antiviral activity, some compounds were tested against human cytomegalovirus (HCMV) in vitro. Human MRCS cells were grown to confluen...
Ligand InfoPC cidPC sid
In DepthDetails US Patent