BDBM575065 US11459321, Example 11
SMILES COCCn1cc(nn1)-c1ccc2CCN(Cc2c1)c1ncc(Cc2ccc(cc2)-n2cccn2)s1
InChI Key InChIKey=SGFFFTPGMZVNKC-UHFFFAOYSA-N
Data  2 IC50
  Tab Delimited (TSV)   2D SDfile   Computed 3D by Vconf -m prep SDfile
Find this compound or compounds like it in BindingDB:
Activity Spreadsheet -- Enzyme Inhibition Constant Data from BindingDB
Found 2 hits for monomerid = 575065
TargetNeuraminidase(Influenza A virus (strain A/Puerto Rico/8/1934 H1N...)
Evrys Bio
US Patent
LigandPNGBDBM575065(US11459321, Example 11)
Affinity DataIC50: >2.50E+4nM. Assay description: To assess their antiviral activity, some compounds were tested against murine adapted human influenza (PR8) in vitro. Canine MDCK cells were grown to...
Ligand InfoPC cidPC sid
In DepthDetails US Patent
LigandPNGBDBM575065(US11459321, Example 11)
Affinity DataIC50:  1.70E+3nM. Assay description: To assess their antiviral activity, some compounds were tested against human cytomegalovirus (HCMV) in vitro. Human MRCS cells were grown to confluen...
Ligand InfoPC cidPC sid
In DepthDetails US Patent