BDBM575089 US11459321, Example 35
SMILES O=C1OCCN1c1ccc2CCN(Cc2c1)c1ncc(Cc2cccc(c2)N2CCOCC2)s1
InChI Key InChIKey=NWQSYBBVLCTWNG-UHFFFAOYSA-N
Data  2 IC50
  Tab Delimited (TSV)   2D SDfile   Computed 3D by Vconf -m prep SDfile
Find this compound or compounds like it in BindingDB:
Activity Spreadsheet -- Enzyme Inhibition Constant Data from BindingDB
Found 2 hits for monomerid = 575089
TargetNeuraminidase(Influenza A virus (strain A/Puerto Rico/8/1934 H1N...)
Evrys Bio
US Patent
LigandPNGBDBM575089(US11459321, Example 35)
Affinity DataIC50:  3.49E+3nM. Assay description: To assess their antiviral activity, some compounds were tested against murine adapted human influenza (PR8) in vitro. Canine MDCK cells were grown to...
Ligand InfoPC cidPC sid
In DepthDetails US Patent
LigandPNGBDBM575089(US11459321, Example 35)
Affinity DataIC50:  891nM. Assay description: To assess their antiviral activity, some compounds were tested against human cytomegalovirus (HCMV) in vitro. Human MRCS cells were grown to confluen...
Ligand InfoPC cidPC sid
In DepthDetails US Patent