BDBM576201 WO2022094012, Example 6B
SMILES CCN1[C@H](C)c2cc(c(OC)cn2)-c2cn3ccnc3c(OCCOCC[C@H](CCC(F)(F)F)NC1=O)n2
InChI Key InChIKey=BRFLXPSLUFOBAF-SJORKVTESA-N
Data  1 EC50
  Tab Delimited (TSV)   2D SDfile   Computed 3D by Vconf -m prep SDfile
Find this compound or compounds like it in BindingDB:
Activity Spreadsheet -- Enzyme Inhibition Constant Data from BindingDB
Found 1 hit for monomerid = 576201
TargetOrexin receptor type 2(Homo sapiens (Human))
Merck Sharp &Amp
WIPO
LigandPNGBDBM576201(WO2022094012, Example 6B)
Affinity DataEC50:  0.600nM. Assay description:  In a typical experiment, the OX1 and OX2 receptor agonist activity is determined in accordance with the following general experimental method. Chine...
Ligand InfoPC cidPC sid
In DepthDetails PubMed