BDBM576215 WO2022094012, Example 19A
SMILES CCN1[C@H](C)c2cccc(c2)-c2cn3ccnc3c(OCCCCC[C@H](NC1=O)c1cscn1)n2
InChI Key InChIKey=UZSIRHUWLXLJLF-NQIIRXRSSA-N
Data  1 EC50
  Tab Delimited (TSV)   2D SDfile   Computed 3D by Vconf -m prep SDfile
Find this compound or compounds like it in BindingDB:
Activity Spreadsheet -- Enzyme Inhibition Constant Data from BindingDB
Found 1 hit for monomerid = 576215
TargetOrexin receptor type 2(Homo sapiens (Human))
Merck Sharp &Amp
WIPO
LigandPNGBDBM576215(WO2022094012, Example 19A)
Affinity DataEC50:  337nM. Assay description:  In a typical experiment, the OX1 and OX2 receptor agonist activity is determined in accordance with the following general experimental method. Chine...
Ligand InfoPC cidPC sid
In DepthDetails PubMed