BDBM576288 WO2022112139, Example 26
SMILES O=C(Nc1ccc(cc1)-c1nnc(o1)-c1ccccc1)c1ncco1
InChI Key InChIKey=ODIIHXDHLFVPSU-UHFFFAOYSA-N
Data  2 IC50
  Tab Delimited (TSV)   2D SDfile   Computed 3D by Vconf -m prep SDfile
Find this compound or compounds like it in BindingDB:
Activity Spreadsheet -- Enzyme Inhibition Constant Data from BindingDB
Found 2 hits for monomerid = 576288
TargetExternal core antigen(HBVgbn)
F. Hoffmann-La Roche
WIPO
LigandPNGBDBM576288(WO2022112139, Example 26)
Affinity DataIC50:  1.42E+3nM. Assay description:  Detailed procedures regarding primary human hepatocyte (PHH) HBV natural infection assay are described as below. One tube of frozen PHH (10 million ...
Ligand InfoPC cidPC sid
In DepthDetails PubMed
TargetLarge envelope protein(Hepatitis B virus)
F. Hoffmann-La Roche
WIPO
LigandPNGBDBM576288(WO2022112139, Example 26)
Affinity DataIC50:  910nM. Assay description:  Detailed procedures regarding primary human hepatocyte (PHH) HBV natural infection assay are described as below. One tube of frozen PHH (10 million ...
Ligand InfoPC cidPC sid
In DepthDetails PubMed