BDBM576340 WO2022112188, Example 22
SMILES Clc1ccc2sc(nc2c1)C1CC2(CC(C2)NC(=O)c2ccc(o2)S(=O)(=O)NC2CCC2)C1
InChI Key InChIKey=ZRZGUCARKWZLBN-UHFFFAOYSA-N
Data  2 IC50
  Tab Delimited (TSV)   2D SDfile   Computed 3D by Vconf -m prep SDfile
Find this compound or compounds like it in BindingDB:
Activity Spreadsheet -- Enzyme Inhibition Constant Data from BindingDB
Found 2 hits for monomerid = 576340
TargetExternal core antigen(HBVgbn)
F. Hoffmann-La Roche
WIPO
LigandPNGBDBM576340(WO2022112188, Example 22)
Affinity DataIC50:  1.00E+3nM. Assay description: Detailed procedures regarding primary human hepatocyte (PHH) HBV natural infection assay are described as below. One tube of frozen PHH (10 million c...
Ligand InfoPC cidPC sid
In DepthDetails PubMed
TargetLarge envelope protein(Hepatitis B virus)
F. Hoffmann-La Roche
WIPO
LigandPNGBDBM576340(WO2022112188, Example 22)
Affinity DataIC50:  1.39E+3nM. Assay description: Detailed procedures regarding primary human hepatocyte (PHH) HBV natural infection assay are described as below. One tube of frozen PHH (10 million c...
Ligand InfoPC cidPC sid
In DepthDetails PubMed