BDBM576366 WO2022112205, Example 21
SMILES CSc1cccc(c1)C(=O)NC12CC(C1)(C2)c1nc2cc(Cl)ccc2o1
InChI Key InChIKey=QISAJBADVONOBL-UHFFFAOYSA-N
Data  2 IC50
  Tab Delimited (TSV)   2D SDfile   Computed 3D by Vconf -m prep SDfile
Find this compound or compounds like it in BindingDB:
Activity Spreadsheet -- Enzyme Inhibition Constant Data from BindingDB
Found 2 hits for monomerid = 576366
TargetExternal core antigen(HBVgbn)
F. Hoffmann-La Roche
WIPO
LigandPNGBDBM576366(WO2022112205, Example 21)
Affinity DataIC50:  1.87E+3nM. Assay description:  Detailed procedures regarding primary human hepatocyte (PHH) HBV natural infection assay are described as below. One tube of frozen PHH (10 million ...
Ligand InfoPC cidPC sid
In DepthDetails PubMed
TargetLarge envelope protein(Hepatitis B virus)
F. Hoffmann-La Roche
WIPO
LigandPNGBDBM576366(WO2022112205, Example 21)
Affinity DataIC50:  2.60E+3nM. Assay description:  Detailed procedures regarding primary human hepatocyte (PHH) HBV natural infection assay are described as below. One tube of frozen PHH (10 million ...
Ligand InfoPC cidPC sid
In DepthDetails PubMed