BDBM576384 N-[6-(5-chloro-1,3-benzoxazol-2-yl)spiro[3.3]heptan-2-yl]-5-methylsulfonyl-furan-2-carboxamide::WO2022112207, Example 15
SMILES CS(=O)(=O)c1ccc(o1)C(=O)NC1CC2(C1)CC(C2)c1nc2cc(Cl)ccc2o1
InChI Key InChIKey=JTKHJALJNCGAAT-UHFFFAOYSA-N
Data  2 IC50
  Tab Delimited (TSV)   2D SDfile   Computed 3D by Vconf -m prep SDfile
Find this compound or compounds like it in BindingDB:
Activity Spreadsheet -- Enzyme Inhibition Constant Data from BindingDB
Found 2 hits for monomerid = 576384
TargetExternal core antigen(HBVgbn)
F. Hoffmann-La Roche
WIPO
LigandPNGBDBM576384(N-[6-(5-chloro-1,3-benzoxazol-2-yl)spiro[3.3]hepta...)
Affinity DataIC50:  1.17E+3nM. Assay description: Detailed procedures regarding primary human hepatocyte (PHH) HBV natural infection assay are described as below. One tube of frozen PHH (10 million c...
Ligand InfoPC cidPC sid
In DepthDetails PubMed
TargetLarge envelope protein(Hepatitis B virus)
F. Hoffmann-La Roche
WIPO
LigandPNGBDBM576384(N-[6-(5-chloro-1,3-benzoxazol-2-yl)spiro[3.3]hepta...)
Affinity DataIC50:  1.95E+3nM. Assay description: Detailed procedures regarding primary human hepatocyte (PHH) HBV natural infection assay are described as below. One tube of frozen PHH (10 million c...
Ligand InfoPC cidPC sid
In DepthDetails PubMed