BDBM576432 WO2022115301, Example 18
SMILES Cc1ccc(nn1)-c1ccc(cc1)-c1cccc2CN(C(C3CC3)C(C)(C)O)C(=O)c12
InChI Key InChIKey=YZYBASMZXFAYHJ-UHFFFAOYSA-N
Data  1 EC50
  Tab Delimited (TSV)   2D SDfile   Computed 3D by Vconf -m prep SDfile
Find this compound or compounds like it in BindingDB:
Activity Spreadsheet -- Enzyme Inhibition Constant Data from BindingDB
Found 1 hit for monomerid = 576432
TargetCeramide glucosyltransferase(Homo sapiens (Human))
Merck Sharp &Amp
WIPO
LigandPNGBDBM576432(WO2022115301, Example 18)
Affinity DataEC50:  45nM. Assay description:  Using Promega’s UDP-Glo™ Glycosyltransferase assay kit (Promega Corporation, Madison, WI, USA (Promega)), GCS activity was indirectly measured by de...
Ligand InfoPC cidPC sid
In DepthDetails PubMed