BDBM577509 US11472838, Compound 27::US11472838, Compound 31a/b
SMILES COC(=O)\C=C\CC[C@H](NC(=O)c1cncc(c1)C(O)=O)C(=O)N[C@H](C(=O)N1CCC[C@H]1C(=O)N[C@@H](C1CCCCC1)C(=O)N[C@@H](C1CCCCC1)C(N)=O)C(C)(C)C
InChI Key InChIKey=HGHMBXSRMHYTTI-YXAJPWJGSA-N
Data  4 IC50
  Tab Delimited (TSV)   2D SDfile   Computed 3D by Vconf -m prep SDfile
Find this compound or compounds like it in BindingDB:
Activity Spreadsheet -- Enzyme Inhibition Constant Data from BindingDB
Found 4 hits for monomerid = 577509
TargetCoagulation factor XIII A chain(Homo sapiens (Human))
Zedira
US Patent
LigandPNGBDBM577509(US11472838, Compound 27 | US11472838, Compound 31a...)
Affinity DataIC50:  27nM. Assay description: FXIIIa activity has been determined using substrate A101 (Zedira GmbH, Darmstadt, Germany), which is based on the N-terminal dodecapeptide of α2...
Ligand InfoPC cidPC sid
In DepthDetails US Patent
TargetProtein-glutamine gamma-glutamyltransferase 2(Homo sapiens (Human))
Zedira
US Patent
LigandPNGBDBM577509(US11472838, Compound 27 | US11472838, Compound 31a...)
Affinity DataIC50:  27nM. Assay description: FXIIIa activity has been determined using substrate A101 (Zedira GmbH, Darmstadt, Germany), which is based on the N-terminal dodecapeptide of α2...
Ligand InfoPC cidPC sid
In DepthDetails US Patent
TargetCoagulation factor XIII A chain(Homo sapiens (Human))
Zedira
US Patent
LigandPNGBDBM577509(US11472838, Compound 27 | US11472838, Compound 31a...)
Affinity DataIC50:  10nM. Assay description: FXIIIa activity has been determined using substrate A101 (Zedira GmbH, Darmstadt, Germany), which is based on the N-terminal dodecapeptide of α2...
Ligand InfoPC cidPC sid
In DepthDetails US Patent
TargetProtein-glutamine gamma-glutamyltransferase 2(Homo sapiens (Human))
Zedira
US Patent
LigandPNGBDBM577509(US11472838, Compound 27 | US11472838, Compound 31a...)
Affinity DataIC50:  64nM. Assay description: FXIIIa activity has been determined using substrate A101 (Zedira GmbH, Darmstadt, Germany), which is based on the N-terminal dodecapeptide of α2...
Ligand InfoPC cidPC sid
In DepthDetails US Patent