BDBM577518 US11472838, Compound 36a/b
SMILES CNC(=O)[C@@H](NC(=O)[C@@H](NC(=O)[C@@H]1CC(=O)CN1C(=O)[C@@H](NC(=O)[C@H](CC\C=C\C(=O)OC)NC(=O)c1ccncc1C(O)=O)C(C)(C)C)C1CCCCC1)C1CCCCC1
InChI Key InChIKey=LWAMOXQCZPZLPQ-BNGZQMJLSA-N
Data  2 IC50
  Tab Delimited (TSV)   2D SDfile   Computed 3D by Vconf -m prep SDfile
Find this compound or compounds like it in BindingDB:
Activity Spreadsheet -- Enzyme Inhibition Constant Data from BindingDB
Found 2 hits for monomerid = 577518
TargetProtein-glutamine gamma-glutamyltransferase 2(Homo sapiens (Human))
Zedira
US Patent
LigandPNGBDBM577518(US11472838, Compound 36a/b)
Affinity DataIC50:  168nM. Assay description: FXIIIa activity has been determined using substrate A101 (Zedira GmbH, Darmstadt, Germany), which is based on the N-terminal dodecapeptide of α2...
Ligand InfoPC cidPC sid
In DepthDetails US Patent
TargetCoagulation factor XIII A chain(Homo sapiens (Human))
Zedira
US Patent
LigandPNGBDBM577518(US11472838, Compound 36a/b)
Affinity DataIC50:  41nM. Assay description: FXIIIa activity has been determined using substrate A101 (Zedira GmbH, Darmstadt, Germany), which is based on the N-terminal dodecapeptide of α2...
Ligand InfoPC cidPC sid
In DepthDetails US Patent