BDBM577540 US11472838, Compound Ref. 16
SMILES CCCC[C@H](NC(=O)[C@H](CC\C=C\C(=O)OC)NC(=O)[C@@H]1CC(=O)CN1)C(=O)N[C@@H](C(C)CC)C(=O)N[C@@H](CC(C)C)C(=O)N1CCC[C@H]1C(O)=O
InChI Key InChIKey=BOSUKVLPWQTYCT-QRDYJYKGSA-N
Data  2 IC50
  Tab Delimited (TSV)   2D SDfile   Computed 3D by Vconf -m prep SDfile
Find this compound or compounds like it in BindingDB:
Activity Spreadsheet -- Enzyme Inhibition Constant Data from BindingDB
Found 2 hits for monomerid = 577540
TargetProtein-glutamine gamma-glutamyltransferase 2(Homo sapiens (Human))
Zedira
US Patent
LigandPNGBDBM577540(US11472838, Compound Ref. 16)
Affinity DataIC50:  196nM. Assay description: FXIIIa activity has been determined using substrate A101 (Zedira GmbH, Darmstadt, Germany), which is based on the N-terminal dodecapeptide of α2...
Ligand InfoPC cidPC sid
In DepthDetails US Patent
TargetCoagulation factor XIII A chain(Homo sapiens (Human))
Zedira
US Patent
LigandPNGBDBM577540(US11472838, Compound Ref. 16)
Affinity DataIC50: >10nM. Assay description: FXIIIa activity has been determined using substrate A101 (Zedira GmbH, Darmstadt, Germany), which is based on the N-terminal dodecapeptide of α2...
Ligand InfoPC cidPC sid
In DepthDetails US Patent