BDBM578756 US11479550, Example 7-3(2)
SMILES CNC(=O)c1ccc2c(C)cn([C@H](C)C(=O)Nc3cc(Cn4cnc(n4)C(F)(F)F)ccc3CCCC(O)=O)c2c1
InChI Key InChIKey=IPMPRTLRFBRRRL-QGZVFWFLSA-N
Data  1 IC50
  Tab Delimited (TSV)   2D SDfile   Computed 3D by Vconf -m prep SDfile
Find this compound or compounds like it in BindingDB:
Activity Spreadsheet -- Enzyme Inhibition Constant Data from BindingDB
Found 1 hit for monomerid = 578756
TargetProstaglandin E2 receptor EP4 subtype(Homo sapiens (Human))
Ono Pharmaceutical
US Patent
LigandPNGBDBM578756(US11479550, Example 7-3(2))
Affinity DataIC50:  1.5nM. Assay description: CHO cells expressing human EP4 receptor subtypes were prepared according to the methods of Nishigaki et al. (Non-Patent Literature 4), and used for e...
Ligand InfoPC cidPC sid
In DepthDetails US Patent