BDBM578773 US11479550, Example 12-1(2)
SMILES CNC(=O)c1ccc2c(C)cn([C@H](C)C(=O)Nc3cc(Cn4cc(C)cn4)ccc3CCCC(O)=O)c2c1
InChI Key InChIKey=JFJRUNMYGJBYRI-HXUWFJFHSA-N
Data  1 IC50
  Tab Delimited (TSV)   2D SDfile   Computed 3D by Vconf -m prep SDfile
Find this compound or compounds like it in BindingDB:
Activity Spreadsheet -- Enzyme Inhibition Constant Data from BindingDB
Found 1 hit for monomerid = 578773
TargetProstaglandin E2 receptor EP4 subtype(Homo sapiens (Human))
Ono Pharmaceutical
US Patent
LigandPNGBDBM578773(US11479550, Example 12-1(2))
Affinity DataIC50:  1.60nM. Assay description: CHO cells expressing human EP4 receptor subtypes were prepared according to the methods of Nishigaki et al. (Non-Patent Literature 4), and used for e...
Ligand InfoPC cidPC sid
In DepthDetails US Patent