BDBM578774 4-[2-({2-[3-methyl-6-(methylcarbamoyl)-1H-indol-1-yl]propanoyl}amino)-4-phenoxyphenyl]butanoic acid::US11479550, Example 13
SMILES CNC(=O)c1ccc2c(C)cn(C(C)C(=O)Nc3cc(Oc4ccccc4)ccc3CCCC(O)=O)c2c1
InChI Key InChIKey=MXYVFNODHDHDND-UHFFFAOYSA-N
Data  1 IC50
  Tab Delimited (TSV)   2D SDfile   Computed 3D by Vconf -m prep SDfile
Find this compound or compounds like it in BindingDB:
Activity Spreadsheet -- Enzyme Inhibition Constant Data from BindingDB
Found 1 hit for monomerid = 578774
TargetProstaglandin E2 receptor EP4 subtype(Homo sapiens (Human))
Ono Pharmaceutical
US Patent
LigandPNGBDBM578774(4-[2-({2-[3-methyl-6-(methylcarbamoyl)-1H-indol-1-...)
Affinity DataIC50:  0.790nM. Assay description: CHO cells expressing human EP4 receptor subtypes were prepared according to the methods of Nishigaki et al. (Non-Patent Literature 4), and used for e...
Ligand InfoPC cidPC sid
In DepthDetails US Patent