BDBM579725 US11485711, Compound 157::ethyl (4-((5-(4- hydroxyphenyl)-1H-pyrazol-3- yl)amino)-3- methylphenyl)carbamate
SMILES CCOC(=O)Nc1ccc(Nc2cc([nH]n2)-c2ccc(O)cc2)c(C)c1
InChI Key InChIKey=KGBLKPGTONLDFJ-UHFFFAOYSA-N
Data  1 IC50
  Tab Delimited (TSV)   2D SDfile   Computed 3D by Vconf -m prep SDfile
Find this compound or compounds like it in BindingDB:
Activity Spreadsheet -- Enzyme Inhibition Constant Data from BindingDB
Found 1 hit for monomerid = 579725
TargetTRAF2 and NCK-interacting protein kinase(Homo sapiens (Human))
Korea Research Institute Of Chemical Technology
US Patent
LigandPNGBDBM579725(US11485711, Compound 157 | ethyl (4-((5-(4- hydrox...)
Affinity DataIC50:  116nM. Assay description: The inhibitory properties of compounds were evaluated with TNIK kinase enzyme system and luminescent ADP-GloFigure US11485711-20221101-P00001 Kinase ...
Ligand InfoPC cidPC sid
In DepthDetails US Patent