BDBM58100 MLS000756543::N-[3-(methylthio)phenyl]carbamic acid cyclododecyl ester::SMR000528790::cid_311389::cyclododecyl N-(3-methylsulfanylphenyl)carbamate
SMILES CSc1cccc(NC(=O)OC2CCCCCCCCCCC2)c1
InChI Key InChIKey=SZWOHQOCXPXIKB-UHFFFAOYSA-N
Data  1 EC50
  Tab Delimited (TSV)   2D SDfile   Computed 3D by Vconf -m prep SDfile
Find this compound or compounds like it in BindingDB:
Activity Spreadsheet -- Enzyme Inhibition Constant Data from BindingDB
Found 1 hit for monomerid = 58100
TargetStreptokinase A(Streptococcus pyogenes M1 GAS)
Broad Institute
Curated by PubChem BioAssay
LigandPNGBDBM58100(MLS000756543 | N-[3-(methylthio)phenyl]carbamic ac...)
Affinity DataEC50:  2.93E+3nM. Assay description: Keywords: Group A streptococcus, GAS, streptokinase, expression, virulence, inhibition, dose response, EC50 Assay Overview: The goal of this assa...
In DepthDetails PCBioAssay