BDBM5827 1-[2-fluoro-5-(trifluoromethyl)phenyl]-3-{4-[(2-{[4-(methanesulfonylmethyl)phenyl]amino}pyrimidin-4-yl)(methyl)amino]phenyl}urea::urea deriv. 18
SMILES CN(c1ccc(NC(=O)Nc2cc(ccc2F)C(F)(F)F)cc1)c1ccnc(Nc2ccc(CS(C)(=O)=O)cc2)n1
InChI Key InChIKey=SPCZPSTVIFPUHB-UHFFFAOYSA-N
Data  1 IC50
  Tab Delimited (TSV)   2D SDfile   Computed 3D by Vconf -m prep SDfile
Find this compound or compounds like it in BindingDB:
Activity Spreadsheet -- Enzyme Inhibition Constant Data from BindingDB
Found 1 hit for monomerid = 5827
TargetVascular endothelial growth factor receptor 2(Homo sapiens (Human))
Glaxosmithkline
LigandPNGBDBM5827(1-[2-fluoro-5-(trifluoromethyl)phenyl]-3-{4-[(2-{[...)
Affinity DataIC50:  2nMpH: 7.5 T: 2°C. Assay description: The assay was using baculovirus-expressed recombinant protein kinase purified as the intracellular domain fused by GST tag, interacting with biotinyl...
In DepthDetails ArticlePubMed