BDBM584502 US11524968, Example 250
SMILES O=C(CC#N)N1CCC(=CC1)c1cc(NC(=O)C2CC2)nc2[nH]ccc12
InChI Key InChIKey=APAPQQWNUNCHPA-UHFFFAOYSA-N
Data  1 IC50
  Tab Delimited (TSV)   2D SDfile   Computed 3D by Vconf -m prep SDfile
Find this compound or compounds like it in BindingDB:
Activity Spreadsheet -- Enzyme Inhibition Constant Data from BindingDB
Found 1 hit for monomerid = 584502
TargetTyrosine-protein kinase JAK1(Homo sapiens (Human))
Hk Inno.N
US Patent
LigandPNGBDBM584502(US11524968, Example 250)
Affinity DataIC50: <20nM. Assay description: A control material and a test material were prepared for each concentration, in such a way that they were diluted by means of DMSO. At the same time,...
Ligand InfoPC cidPC sid
In DepthDetails US Patent