BDBM584519 US11524968, Example 267
SMILES O=C(Nc1cc(C2=CCN(CC2)C(=O)[C@@H]2C[C@@H]2C#N)c2cc[nH]c2n1)C1CC1
InChI Key
Data  1 IC50
  Tab Delimited (TSV)   2D SDfile   Computed 3D by Vconf -m prep SDfile
Find this compound or compounds like it in BindingDB:
Activity Spreadsheet -- Enzyme Inhibition Constant Data from BindingDB
Found 1 hit for monomerid = 584519
TargetTyrosine-protein kinase JAK1(Homo sapiens (Human))
Hk Inno.N
US Patent
LigandPNGBDBM584519(US11524968, Example 267)
Affinity DataIC50: <20nM. Assay description: A control material and a test material were prepared for each concentration, in such a way that they were diluted by means of DMSO. At the same time,...
Ligand InfoPC cidPC sid
In DepthDetails US Patent