BDBM585375 US11530209, Compound E6
SMILES COCCNc1c(nc2cnccn12)-c1c(O)ccc2ccccc12
InChI Key InChIKey=RNYRMPOYXKWBDM-UHFFFAOYSA-N
Data  1 IC50
  Tab Delimited (TSV)   2D SDfile   Computed 3D by Vconf -m prep SDfile
Find this compound or compounds like it in BindingDB:
Activity Spreadsheet -- Enzyme Inhibition Constant Data from BindingDB
Found 1 hit for monomerid = 585375
TargetSal-like protein 4(Human)
Dana-Farber Cancer Institute
US Patent
LigandPNGBDBM585375(US11530209, Compound E6)
Affinity DataIC50:  434nM. Assay description: TBD
Ligand InfoPC cidPC sid
In DepthDetails US Patent