BDBM585380 US11530209, Compound E11
SMILES Oc1ccc2ccccc2c1-c1nc2cnccn2c1NCc1ccccc1
InChI Key InChIKey=NDZPODAXEXUQKN-UHFFFAOYSA-N
Data  1 IC50
  Tab Delimited (TSV)   2D SDfile   Computed 3D by Vconf -m prep SDfile
Find this compound or compounds like it in BindingDB:
Activity Spreadsheet -- Enzyme Inhibition Constant Data from BindingDB
Found 1 hit for monomerid = 585380
TargetSal-like protein 4(Human)
Dana-Farber Cancer Institute
US Patent
LigandPNGBDBM585380(US11530209, Compound E11)
Affinity DataIC50:  594nM. Assay description: TBD
Ligand InfoPC cidPC sid
In DepthDetails US Patent